{"text_format":"1","workbook":"xlsx","n_sheets":15,"sheets":["Sheet1","Budget","Jul","Aug","Sep","Oct","Nov","Dec","Jan","Feb","Mar","Apr","May","Jun","CloseOut"],"not_rendered":{"charts":0,"images":0,"macros":1,"external_links":0,"defined_names":105,"comments":0,"pivot_tables":0},"unopened":[],"bounds":{"document_bytes":16777216,"sheet_cells":100000,"rows_first":2000,"rows_last":500,"rows_between":2000,"halvings":0,"cell_chars":16384,"cell_head_chars":4096},"cells_cut":0,"cells_raw":0,"read":"whole","date_system":"1900"}

{"sheet":"Sheet1","index":0,"n_rows":15,"n_cols":38,"rows_kept":15,"cut":false,"hidden":true,"merged":[]}
[null,"Beginning Date","2013-07-01"]
[null,null,null,null,null,null,null,null,null,null,null,null,null,null,"Budget"]
[null,null,null,null,null,null,null,null,null,null,null,null,null,null,14,null,null,null,null,null,null,null,null,null,null,null,null,null,null,null,null,null,null,null,null,null,21]
[null,"Select A Name","Grant #","PO#","Program ","Cash Match ","In-Kind Match","Program Income",null,null,null,null,"Federal Funds",null,{"$f":"+Budget!M9","v":"Director - Williams"},{"$f":"+Budget!M10","v":"Grants Manager - Yoon"},{"$f":"+Budget!M11","v":"FAST Coordinator - Deem"},{"$f":"+Budget!M12","v":"Support Staff - Pillado"},{"$f":"+Budget!M14","v":"Volunteers"},{"$f":"+Budget!M17","v":"Mileage"},{"$f":"+Budget!M18","v":"Training"},{"$f":"+Budget!M21","v":" "},{"$f":"+Budget!M22","v":" "},{"$f":"+Budget!M23","v":" "},{"$f":"+Budget!M26","v":"Consultants"},{"$f":"+Budget!M34","v":"Accounting/ Bookkeeping"},{"$f":"+Budget!M35","v":"Communications/Phone"},{"$f":"+Budget!M36","v":"Insurance"},{"$f":"+Budget!M37","v":"Office Supplies"},{"$f":"+Budget!M38","v":"Repairs"},{"$f":"+Budget!M39","v":"Printing/Postage"},{"$f":"+Budget!M40","v":"Rent/Utilities"},"Total",null,"Contact","Phone","Address"]
[1]
[2,"Grey Law of Ventura, Inc","3B-580-1112-S","PC 5700B140065","Legal Svs: 3B, 7B & HI",{"$f":"+Budget!F29","v":0},{"$f":"+Budget!F30","v":0},{"$f":"+Budget!F34","v":0},56000,{"$f":"+I6/M6","v":1},0,{"$f":"+K6/M6","v":0},{"$f":"+I6+K6","v":56000},null,{"$f":"+Budget!O9","v":0},6000,{"$f":"+Budget!O11","v":0},14000,{"$f":"+Budget!O14","v":0},0,600,{"$f":"+Budget!O21","v":0},{"$f":"+Budget!O22","v":0},{"$f":"+Budget!O23","v":0},2000,{"$f":"+Budget!O34","v":0},1200,2500,1200,0,500,11000,{"$f":"SUM(O6:AF6)","v":39000},null,"Michael Williams, Esq.","805-658-2266","290 Maple Court, #128, Ventura, CA 93003-3521","CFDA: 3B:93.044,7B:93.041, HI 93.779"]
[]
[null,null,null,null,null,null,null,null,{"$f":"SUM(I5:I7)","v":56000},null,{"$f":"SUM(K5:K7)","v":0},null,{"$f":"SUM(M5:M7)","v":56000},null,{"$f":"SUM(O5:O7)","v":0},6000,null,null,null,0,null,0,0,null,null,null,null,null,null,null,null,null,39000]
{"$rows_left_out":8}
{"sheet":"Budget","index":1,"n_rows":55,"n_cols":40,"rows_kept":55,"cut":false,"hidden":false,"merged":[[25,12,25,13],[48,1,48,3],[50,1,50,3],[38,1,38,4],[40,1,40,4],[42,1,42,4],[46,1,46,4],[47,1,47,3],[38,5,38,9],[40,5,40,9],[42,5,42,9],[26,12,26,13],[8,0,8,1],[8,2,8,4],[25,8,28,9],[16,8,16,9],[26,1,26,3],[27,1,27,3],[28,1,28,3],[6,2,6,9],[4,5,4,6],[2,5,2,6],[2,7,2,9],[4,7,4,9],[0,0,0,1],[0,2,0,6],[2,0,2,1],[2,2,2,4],[4,0,4,1],[4,2,4,4],[6,0,6,1],[33,1,33,3],[34,1,34,3],[35,1,35,3],[19,1,19,3],[20,1,20,3],[21,1,21,3],[22,1,22,3],[23,1,23,3],[24,1,24,3],[25,1,25,3],[16,2,16,3],[29,1,29,3],[30,1,30,3],[31,1,31,3],[32,1,32,3],[2,28,2,33],[17,27,17,29],[18,27,18,29],[19,27,19,29],[5,16,6,16],[5,18,5,21],[5,23,5,24],[2,23,2,24],[3,24,4,24],[24,12,24,13],[12,12,12,13],[13,12,13,13],[14,12,14,13],[10,12,10,13],[11,12,11,13],[5,12,6,13],[5,14,6,14],[5,15,6,15],[9,12,9,13],[2,13,2,20],[3,12,4,12],[3,13,4,14],[3,20,4,23],[3,15,4,17],[0,15,0,18],[54,12,54,24],[7,12,7,13],[16,12,16,13],[20,12,20,13],[22,12,22,13],[27,12,27,13],[31,12,31,13],[32,12,32,13],[46,12,46,13],[47,12,47,13],[45,12,45,13],[17,12,17,13],[18,12,18,13],[23,12,23,13],[8,12,8,13]]}
["Grantee Name:",null,null,null,null,null,null,null,"2023-07-01","2024-06-30","Page 1",null,{"$f":"C1","v":0},null,null," 3B/7A/HI: Legal",null,null,null,null,null,null,null,null,"Page 2",null,null,null,null,null,null,null,null,null,null,null,null,null,null,"Page 3"]
[]
["Contact Name :",null,null,null,null,"Telephone:",null,null,null,null,null,null,"AGENCY NAME:      ",{"$f":"+C1","v":0},null,null,null,null,null,null,null,null,null," ",null,null,{"$f":"+M1","v":0},null,{"$f":"+N3","v":0}]
[null,null,null,null,null,null,null,null,null,null,null,null,null,null,null,"Budget Details "]
["Contact email :",null,null,null,null,"Program","Legal Services","Legal Services",null,null,null,null,null,null,null,null,null,null,null,null,null,null,null,null,null,null,"Please enter data in the light blue cells",null,null,null,"ASSUMPTIONS"]
[null,null,null,null,null,null,null,null,null,null,null,null,"PROJECT BUDGET CATEGORIES",null,"Current Budget","Change","Revised Budget",null,"3B",null,null,null,"HICAP","FAST - 7B"]
["Address:",null,null,null,null,null,null,null,null,null,null,null,null,null,null,null,null,null,"Total 3B","Grant Funds","Cash Match","IN-KIND","Grant Funds","Grant Funds","Cash Match",null,null,null,null,null,null,"Funding"]
[null,null,null,null,null,null,null,null,null,null,"Match",null,"PERSONNEL (List title & pay):",null,null,null,null,null,null,null,null,null,null,null,null,null,"PERSONNEL STAFFING","FTES","Payroll Cost","% TO PROGRAM","TOTAL","GRANT FUNDING","CASH MATCH","IN-KIND MATCH","TOTAL",null,"3B Legal","FAST","HICAP","Total"]
{"$rows_left_out":48}
{"sheet":"Jul","index":2,"n_rows":59,"n_cols":10,"rows_kept":59,"cut":false,"hidden":false,"merged":[[4,5,4,9],[0,7,0,8],[48,5,48,7],[49,0,49,9],[47,0,47,1],[20,0,20,1],[29,0,29,1],[48,0,48,1],[46,0,46,1],[43,0,43,1],[2,6,2,8],[25,0,25,1],[6,0,6,1],[7,0,7,1],[16,0,16,1],[0,1,0,2],[56,3,56,4],[57,3,57,4],[58,3,58,4],[56,0,56,1],[50,0,50,9],[51,5,52,7],[53,5,54,7],[51,1,51,2],[52,1,52,2],[53,1,53,2],[51,9,52,9],[53,9,54,9]]}
["Contractor Name: ",null,null,"Month:",{"$f":"Budget!I1","v":"2023-07-01"},"Contract #:",{"$f":"Budget!C9","v":0},"GRANT AWARD AMOUNT: ",null,{"$f":"+Budget!J14","v":0}]
["Project Name: ",{"$f":"VLOOKUP($B$1,Sheet1!$B$5:$AK$7,4,FALSE)","v":{"$error":"#N/A"}},null,null,null,"Contact: ",{"$f":"VLOOKUP($B$1,Sheet1!$B$5:$AK$8,34,FALSE)","v":{"$error":"#N/A"}},"Phone:  ",{"$f":"VLOOKUP($B$1,Sheet1!$B$5:$AK$8,35,FALSE)","v":{"$error":"#N/A"}}]
[null,{"$f":"VLOOKUP($B$1,Sheet1!$B$5:$AM$7,37,FALSE)","v":{"$error":"#N/A"}},null,null,null,"Address:",{"$f":"+Budget!C7","v":0}]
[]
[null,null,null,null,null,"Current Month Expenditures by Funding Source"]
[" Item  Description",null,"Authorized Budget ","YTD Actual Expenses ","Current Month Expenses ","Grant Funds","Cash Match","In-Kind Match","Program Income","Cash Non-Match"]
["APPROVED BUDGET",null,{"$f":"+C47","v":0},{"$f":"+E7","v":0},{"$f":"+E46","v":0},{"$f":"+Budget!I17","v":0},{"$f":"+Budget!F29","v":0},{"$f":"+Budget!F30","v":0},{"$f":"+Budget!F34","v":0},{"$f":"VLOOKUP($B$1,Sheet1!$B$5:$AK$7,7,FALSE)","v":{"$error":"#N/A"}}]
[]
{"$rows_left_out":52}
{"sheet":"Aug","index":3,"n_rows":59,"n_cols":10,"rows_kept":59,"cut":false,"hidden":false,"merged":[[4,5,4,9],[0,7,0,8],[7,0,7,1],[20,0,20,1],[48,0,48,1],[47,0,47,1],[46,0,46,1],[29,0,29,1],[25,0,25,1],[43,0,43,1],[16,0,16,1],[2,6,2,8],[57,3,57,4],[58,3,58,4],[56,0,56,1],[49,0,49,9],[48,5,48,7],[56,3,56,4],[50,0,50,9],[51,5,52,7],[53,5,54,7],[51,1,51,2],[53,1,53,2],[52,1,52,2],[54,1,54,2],[51,9,52,9],[53,9,54,9]]}
["Contractor Name: ",{"$f":"+Jul!B1","v":0},{"$f":"+Jul!E1+31","v":"2023-08-01"},"Month:",{"$f":"+Jul!E1+31","v":"2023-08-01"},"Contract #:",{"$f":"Budget!C9","v":0},"GRANT AWARD AMOUNT: ",null,{"$f":"+Jul!J1","v":0}]
["Project Name: ",{"$f":"VLOOKUP($B$1,Sheet1!$B$5:$AK$7,4,FALSE)","v":{"$error":"#N/A"}},null,null,null,"Contact: ",{"$f":"+Jul!G2","v":{"$error":"#N/A"}},"Phone:  ",{"$f":"+Jul!I2","v":{"$error":"#N/A"}}]
[null,{"$f":"VLOOKUP($B$1,Sheet1!$B$5:$AM$7,37,FALSE)","v":{"$error":"#N/A"}},null,null,null,"Address:",{"$f":"+Jul!G3","v":0}]
[]
[null,null,null,null,null,"Current Month Expenditures by Funding Source"]
[" Item  Description",null,"Authorized Budget ","YTD Actual Expenses ","Current Month Expenses ","Grant Funds","Cash Match","In-Kind Match","Program Income","Cash Non-Match"]
["APPROVED BUDGET",null,{"$f":"+Jul!C7","v":0},{"$f":"+D47","v":0},{"$f":"+E46","v":0},{"$f":"+Budget!I17","v":0},{"$f":"+Budget!F29","v":0},{"$f":"+Budget!F30","v":0},{"$f":"+Budget!F34","v":0},{"$f":"VLOOKUP($B$1,Sheet1!$B$5:$AK$7,7,FALSE)","v":{"$error":"#N/A"}}]
[]
{"$rows_left_out":52}
{"sheet":"Sep","index":4,"n_rows":59,"n_cols":10,"rows_kept":59,"cut":false,"hidden":false,"merged":[[54,1,54,2],[51,9,52,9],[53,9,54,9],[0,7,0,8],[0,1,0,2],[16,0,16,1],[20,0,20,1],[29,0,29,1],[25,0,25,1],[4,5,4,9],[2,6,2,8],[56,3,56,4],[50,0,50,9],[57,3,57,4],[58,3,58,4],[43,0,43,1],[48,5,48,7],[46,0,46,1],[56,0,56,1],[47,0,47,1],[49,0,49,9],[48,0,48,1],[51,5,52,7],[53,5,54,7],[51,1,51,2],[53,1,53,2],[52,1,52,2]]}
[{"$f":"+Aug!A1","v":"Contractor Name: "},{"$f":"+Aug!B1","v":0},null,"Month:",{"$f":"+Aug!E1+31","v":"2023-09-01"},"Contract #:",{"$f":"Budget!C9","v":0},"GRANT AWARD AMOUNT: ",null,{"$f":"+Jul!J1","v":0}]
[{"$f":"+Aug!A2","v":"Project Name: "},{"$f":"VLOOKUP($B$1,Sheet1!$B$5:$AK$7,4,FALSE)","v":{"$error":"#N/A"}},null,null,null,"Contact: ",{"$f":"+Aug!G2","v":{"$error":"#N/A"}},{"$f":"+Aug!H2","v":"Phone:  "},{"$f":"+Aug!I2","v":{"$error":"#N/A"}}]
[null,{"$f":"VLOOKUP($B$1,Sheet1!$B$5:$AM$7,37,FALSE)","v":{"$error":"#N/A"}},null,null,null,"Address:",{"$f":"+Aug!G3","v":0}]
[]
[null,null,null,null,null,"Current Month Expenditures by Funding Source"]
[" Item  Description",null,"Authorized Budget ","YTD Actual Expenses ","Current Month Expenses ","Grant Funds","Cash Match","In-Kind Match","Program Income","Cash Non-Match"]
["APPROVED BUDGET",null,{"$f":"+Aug!C7","v":0},{"$f":"+D47","v":0},{"$f":"+E46","v":0},{"$f":"+Budget!I17","v":0},{"$f":"+Budget!F29","v":0},{"$f":"+Budget!F30","v":0},{"$f":"+Budget!F34","v":0},{"$f":"VLOOKUP($B$1,Sheet1!$B$5:$AK$7,7,FALSE)","v":{"$error":"#N/A"}}]
[]
{"$rows_left_out":52}
{"sheet":"Oct","index":5,"n_rows":59,"n_cols":10,"rows_kept":59,"cut":false,"hidden":false,"merged":[[51,1,51,2],[53,1,53,2],[52,1,52,2],[54,1,54,2],[51,9,52,9],[53,9,54,9],[2,6,2,8],[57,3,57,4],[58,3,58,4],[51,5,52,7],[53,5,54,7],[0,1,0,2],[48,0,48,1],[49,0,49,9],[56,0,56,1],[47,0,47,1],[16,0,16,1],[48,5,48,7],[20,0,20,1],[29,0,29,1],[25,0,25,1],[43,0,43,1],[46,0,46,1],[4,5,4,9],[0,7,0,8],[56,3,56,4],[50,0,50,9]]}
[{"$f":"+Sep!A1","v":"Contractor Name: "},{"$f":"+Sep!B1","v":0},null,"Month:",{"$f":"+Sep!E1+31","v":"2023-10-02"},"Contract #:",{"$f":"Budget!C9","v":0},"GRANT AWARD AMOUNT: ",null,{"$f":"+Budget!I17","v":0}]
[{"$f":"+Sep!A2","v":"Project Name: "},{"$f":"VLOOKUP($B$1,Sheet1!$B$5:$AK$7,4,FALSE)","v":{"$error":"#N/A"}},null,null,null,"Contact: ",{"$f":"+Sep!G2","v":{"$error":"#N/A"}},{"$f":"+Sep!H2","v":"Phone:  "},{"$f":"+Sep!I2","v":{"$error":"#N/A"}}]
[null,{"$f":"VLOOKUP($B$1,Sheet1!$B$5:$AM$7,37,FALSE)","v":{"$error":"#N/A"}},null,null,null,"Address:",{"$f":"+Sep!G3","v":0}]
[]
[null,null,null,null,null,"Current Month Expenditures by Funding Source"]
[" Item  Description",null,"Authorized Budget ","YTD Actual Expenses ","Current Month Expenses ","Grant Funds","Cash Match","In-Kind Match","Program Income","Cash Non-Match"]
["APPROVED BUDGET",null,{"$f":"+Budget!O48","v":0},{"$f":"+D47","v":0},{"$f":"+E46","v":0},{"$f":"+Budget!F36","v":0},{"$f":"+Budget!F29","v":0},{"$f":"+Budget!F30","v":0},{"$f":"+Budget!F35","v":0}]
[]
{"$rows_left_out":52}
{"sheet":"Nov","index":6,"n_rows":59,"n_cols":10,"rows_kept":59,"cut":false,"hidden":false,"merged":[[54,1,54,2],[51,9,52,9],[53,9,54,9],[0,7,0,8],[0,1,0,2],[16,0,16,1],[20,0,20,1],[29,0,29,1],[25,0,25,1],[4,5,4,9],[2,6,2,8],[56,3,56,4],[50,0,50,9],[57,3,57,4],[58,3,58,4],[43,0,43,1],[48,5,48,7],[46,0,46,1],[56,0,56,1],[47,0,47,1],[49,0,49,9],[48,0,48,1],[51,5,52,7],[53,5,54,7],[51,1,51,2],[53,1,53,2],[52,1,52,2]]}
[{"$f":"+Oct!A1","v":"Contractor Name: "},{"$f":"+Oct!B1","v":0},null,"Month:",{"$f":"+Oct!E1+31","v":"2023-11-02"},"Contract #:",{"$f":"Budget!C9","v":0},"GRANT AWARD AMOUNT: ",null,{"$f":"+Budget!I17","v":0}]
[{"$f":"+Oct!A2","v":"Project Name: "},{"$f":"VLOOKUP($B$1,Sheet1!$B$5:$AK$7,4,FALSE)","v":{"$error":"#N/A"}},null,null,null,"Contact: ",{"$f":"+Oct!G2","v":{"$error":"#N/A"}},{"$f":"+Oct!H2","v":"Phone:  "},{"$f":"+Oct!I2","v":{"$error":"#N/A"}}]
[null,{"$f":"VLOOKUP($B$1,Sheet1!$B$5:$AM$7,37,FALSE)","v":{"$error":"#N/A"}},null,null,null,"Address:",{"$f":"+Oct!G3","v":0}]
[]
[null,null,null,null,null,"Current Month Expenditures by Funding Source"]
[" Item  Description",null,"Authorized Budget ","YTD Actual Expenses ","Current Month Expenses ","Grant Funds","Cash Match","In-Kind Match","Program Income","Cash Non-Match"]
["APPROVED BUDGET",null,{"$f":"+Oct!C7","v":0},{"$f":"+D47","v":0},{"$f":"+E46","v":0},{"$f":"+Budget!F36","v":0},{"$f":"+Budget!F29","v":0},{"$f":"+Budget!F30","v":0},{"$f":"+Budget!F35","v":0},{"$f":"+Budget!F300","v":0}]
[]
{"$rows_left_out":52}
{"sheet":"Dec","index":7,"n_rows":59,"n_cols":10,"rows_kept":59,"cut":false,"hidden":false,"merged":[[54,1,54,2],[51,9,52,9],[53,9,54,9],[0,7,0,8],[0,1,0,2],[16,0,16,1],[20,0,20,1],[29,0,29,1],[25,0,25,1],[4,5,4,9],[2,6,2,8],[56,3,56,4],[50,0,50,9],[57,3,57,4],[58,3,58,4],[43,0,43,1],[48,5,48,7],[46,0,46,1],[56,0,56,1],[47,0,47,1],[49,0,49,9],[48,0,48,1],[51,5,52,7],[53,5,54,7],[51,1,51,2],[53,1,53,2],[52,1,52,2]]}
[{"$f":"+Nov!A1","v":"Contractor Name: "},{"$f":"+Nov!B1","v":0},null,"Month:",{"$f":"+Nov!E1+30","v":"2023-12-02"},"Contract #:",{"$f":"Budget!C9","v":0},"GRANT AWARD AMOUNT: ",null,{"$f":"+Budget!I17","v":0}]
[{"$f":"+Nov!A2","v":"Project Name: "},{"$f":"VLOOKUP($B$1,Sheet1!$B$5:$AK$7,4,FALSE)","v":{"$error":"#N/A"}},null,null,null,"Contact: ",{"$f":"+Nov!G2","v":{"$error":"#N/A"}},{"$f":"+Nov!H2","v":"Phone:  "},{"$f":"+Nov!I2","v":{"$error":"#N/A"}}]
[null,{"$f":"VLOOKUP($B$1,Sheet1!$B$5:$AM$7,37,FALSE)","v":{"$error":"#N/A"}},null,null,null,"Address:",{"$f":"+Aug!G3","v":0}]
[]
[null,null,null,null,null,"Current Month Expenditures by Funding Source"]
[" Item  Description",null,"Authorized Budget ","YTD Actual Expenses ","Current Month Expenses ","Grant Funds","Cash Match","In-Kind Match","Program Income","Cash Non-Match"]
["APPROVED BUDGET",null,{"$f":"+Nov!C7","v":0},{"$f":"+D47","v":0},{"$f":"+E46","v":0},{"$f":"+Budget!F36","v":0},{"$f":"+Budget!F29","v":0},{"$f":"+Budget!F30","v":0},{"$f":"+Budget!F35","v":0},{"$f":"+Budget!F300","v":0}]
[]
{"$rows_left_out":52}
{"sheet":"Jan","index":8,"n_rows":59,"n_cols":10,"rows_kept":59,"cut":false,"hidden":false,"merged":[[54,1,54,2],[51,9,52,9],[53,9,54,9],[0,7,0,8],[0,1,0,2],[16,0,16,1],[20,0,20,1],[29,0,29,1],[25,0,25,1],[4,5,4,9],[2,6,2,8],[56,3,56,4],[50,0,50,9],[57,3,57,4],[58,3,58,4],[43,0,43,1],[48,5,48,7],[46,0,46,1],[56,0,56,1],[47,0,47,1],[49,0,49,9],[48,0,48,1],[51,5,52,7],[53,5,54,7],[51,1,51,2],[53,1,53,2],[52,1,52,2]]}
[{"$f":"+Dec!A1","v":"Contractor Name: "},{"$f":"+Dec!B1","v":0},null,"Month:",{"$f":"+Dec!E1+31","v":"2024-01-02"},"Contract #:",{"$f":"Budget!C9","v":0},"GRANT AWARD AMOUNT: ",null,{"$f":"+Budget!I17","v":0}]
[{"$f":"+Dec!A2","v":"Project Name: "},{"$f":"VLOOKUP($B$1,Sheet1!$B$5:$AK$7,4,FALSE)","v":{"$error":"#N/A"}},null,null,null,"Contact: ",{"$f":"+Dec!G2","v":{"$error":"#N/A"}},{"$f":"+Dec!H2","v":"Phone:  "},{"$f":"+Dec!I2","v":{"$error":"#N/A"}}]
[null,{"$f":"VLOOKUP($B$1,Sheet1!$B$5:$AM$7,37,FALSE)","v":{"$error":"#N/A"}},null,null,null,"Address:",{"$f":"+Dec!G3","v":0}]
[]
[null,null,null,null,null,"Current Month Expenditures by Funding Source"]
[" Item  Description",null,"Authorized Budget ","YTD Actual Expenses ","Current Month Expenses ","Grant Funds","Cash Match","In-Kind Match","Program Income","Cash Non-Match"]
["APPROVED BUDGET",null,{"$f":"+Dec!C7","v":0},{"$f":"+D47","v":0},{"$f":"+E46","v":0},{"$f":"+Budget!F36","v":0},{"$f":"+Budget!F29","v":0},{"$f":"+Budget!F30","v":0},{"$f":"+Budget!F35","v":0},{"$f":"+Budget!F300","v":0}]
[]
{"$rows_left_out":52}
{"sheet":"Feb","index":9,"n_rows":59,"n_cols":10,"rows_kept":59,"cut":false,"hidden":false,"merged":[[0,1,0,2],[16,0,16,1],[48,5,48,7],[46,0,46,1],[47,0,47,1],[48,0,48,1],[20,0,20,1],[29,0,29,1],[25,0,25,1],[43,0,43,1],[2,6,2,8],[4,5,4,9],[0,7,0,8],[57,3,57,4],[58,3,58,4],[49,0,49,9],[56,3,56,4],[50,0,50,9],[51,5,52,7],[53,5,54,7],[51,1,51,2],[53,1,53,2],[52,1,52,2],[54,1,54,2],[51,9,52,9],[53,9,54,9]]}
[{"$f":"+Jan!A1","v":"Contractor Name: "},{"$f":"+Jan!B1","v":0},null,"Month:",{"$f":"+Jan!E1+31","v":"2024-02-02"},"Contract #:",{"$f":"Budget!C9","v":0},"GRANT AWARD AMOUNT: ",null,{"$f":"+Budget!I17","v":0}]
[{"$f":"+Jan!A2","v":"Project Name: "},{"$f":"VLOOKUP($B$1,Sheet1!$B$5:$AK$7,4,FALSE)","v":{"$error":"#N/A"}},null,null,null,"Contact: ",{"$f":"+Jan!G2","v":{"$error":"#N/A"}},{"$f":"+Jan!H2","v":"Phone:  "},{"$f":"+Jan!I2","v":{"$error":"#N/A"}}]
[null,{"$f":"VLOOKUP($B$1,Sheet1!$B$5:$AM$7,37,FALSE)","v":{"$error":"#N/A"}},null,null,null,"Address:",{"$f":"+Jan!G3","v":0}]
[]
[null,null,null,null,null,"Current Month Expenditures by Funding Source"]
[" Item  Description",null,"Authorized Budget ","YTD Actual Expenses ","Current Month Expenses ","Grant Funds","Cash Match","In-Kind Match","Program Income","Cash Non-Match"]
["APPROVED BUDGET",null,{"$f":"+Jan!C7","v":0},{"$f":"+D47","v":0},{"$f":"+E46","v":0},{"$f":"+Budget!F36","v":0},{"$f":"+Budget!F29","v":0},{"$f":"+Budget!F30","v":0},{"$f":"+Budget!F35","v":0},{"$f":"+Budget!F300","v":0}]
[]
{"$rows_left_out":52}
{"sheet":"Mar","index":10,"n_rows":59,"n_cols":10,"rows_kept":59,"cut":false,"hidden":false,"merged":[[54,1,54,2],[51,9,52,9],[53,9,54,9],[0,7,0,8],[0,1,0,2],[16,0,16,1],[20,0,20,1],[29,0,29,1],[25,0,25,1],[4,5,4,9],[2,6,2,8],[56,3,56,4],[50,0,50,9],[57,3,57,4],[58,3,58,4],[43,0,43,1],[48,5,48,7],[46,0,46,1],[56,0,56,1],[47,0,47,1],[49,0,49,9],[48,0,48,1],[51,5,52,7],[53,5,54,7],[51,1,51,2],[53,1,53,2],[52,1,52,2]]}
[{"$f":"+Feb!A1","v":"Contractor Name: "},{"$f":"+Feb!B1","v":0},null,"Month:",{"$f":"+Feb!E1+31","v":"2024-03-04"},"Contract #:",{"$f":"Budget!C9","v":0},"GRANT AWARD AMOUNT: ",null,{"$f":"+Budget!I17","v":0}]
[{"$f":"+Feb!A2","v":"Project Name: "},{"$f":"VLOOKUP($B$1,Sheet1!$B$5:$AK$7,4,FALSE)","v":{"$error":"#N/A"}},null,null,null,"Contact: ",{"$f":"+Feb!G2","v":{"$error":"#N/A"}},{"$f":"+Feb!H2","v":"Phone:  "},{"$f":"+Feb!I2","v":{"$error":"#N/A"}}]
[null,{"$f":"VLOOKUP($B$1,Sheet1!$B$5:$AM$7,37,FALSE)","v":{"$error":"#N/A"}},null,null,null,"Address:",{"$f":"+Feb!G3","v":0}]
[]
[null,null,null,null,null,"Current Month Expenditures by Funding Source"]
[" Item  Description",null,"Authorized Budget ","YTD Actual Expenses ","Current Month Expenses ","Grant Funds","Cash Match","In-Kind Match","Program Income","Cash Non-Match"]
["APPROVED BUDGET",null,{"$f":"+Feb!C7","v":0},{"$f":"+D47","v":0},{"$f":"+E46","v":0},{"$f":"+Budget!F36","v":0},{"$f":"+Budget!F29","v":0},{"$f":"+Budget!F30","v":0},{"$f":"+Budget!F35","v":0},{"$f":"+Budget!F300","v":0}]
[]
{"$rows_left_out":52}
{"sheet":"Apr","index":11,"n_rows":59,"n_cols":10,"rows_kept":59,"cut":false,"hidden":false,"merged":[[54,1,54,2],[51,9,52,9],[53,9,54,9],[0,7,0,8],[0,1,0,2],[16,0,16,1],[20,0,20,1],[29,0,29,1],[25,0,25,1],[4,5,4,9],[2,6,2,8],[56,3,56,4],[50,0,50,9],[57,3,57,4],[58,3,58,4],[43,0,43,1],[48,5,48,7],[46,0,46,1],[56,0,56,1],[47,0,47,1],[49,0,49,9],[48,0,48,1],[51,5,52,7],[53,5,54,7],[51,1,51,2],[53,1,53,2],[52,1,52,2]]}
[{"$f":"+Mar!A1","v":"Contractor Name: "},{"$f":"+Mar!B1","v":0},null,"Month:",{"$f":"+Mar!E1+30","v":"2024-04-03"},"Contract #:",{"$f":"Budget!C9","v":0},"GRANT AWARD AMOUNT: ",null,{"$f":"+Budget!I17","v":0}]
[{"$f":"+Mar!A2","v":"Project Name: "},{"$f":"VLOOKUP($B$1,Sheet1!$B$5:$AK$7,4,FALSE)","v":{"$error":"#N/A"}},null,null,null,"Contact: ",{"$f":"+Mar!G2","v":{"$error":"#N/A"}},{"$f":"+Mar!H2","v":"Phone:  "},{"$f":"+Mar!I2","v":{"$error":"#N/A"}}]
[null,{"$f":"VLOOKUP($B$1,Sheet1!$B$5:$AM$7,37,FALSE)","v":{"$error":"#N/A"}},null,null,null,"Address:",{"$f":"+Mar!G3","v":0}]
[]
[null,null,null,null,null,"Current Month Expenditures by Funding Source"]
[" Item  Description",null,"Authorized Budget ","YTD Actual Expenses ","Current Month Expenses ","Grant Funds","Cash Match","In-Kind Match","Program Income","Cash Non-Match"]
["APPROVED BUDGET",null,{"$f":"+Mar!C7","v":0},{"$f":"+D47","v":0},{"$f":"+E46","v":0},{"$f":"+Budget!F36","v":0},{"$f":"+Budget!F29","v":0},{"$f":"+Budget!F30","v":0},{"$f":"+Budget!F35","v":0},{"$f":"+Budget!F300","v":0}]
[]
{"$rows_left_out":52}
{"sheet":"May","index":12,"n_rows":59,"n_cols":10,"rows_kept":59,"cut":false,"hidden":false,"merged":[[54,1,54,2],[51,9,52,9],[53,9,54,9],[0,7,0,8],[0,1,0,2],[16,0,16,1],[20,0,20,1],[29,0,29,1],[25,0,25,1],[4,5,4,9],[2,6,2,8],[56,3,56,4],[50,0,50,9],[57,3,57,4],[58,3,58,4],[43,0,43,1],[48,5,48,7],[46,0,46,1],[56,0,56,1],[47,0,47,1],[49,0,49,9],[48,0,48,1],[51,5,52,7],[53,5,54,7],[51,1,51,2],[53,1,53,2],[52,1,52,2]]}
[{"$f":"+Apr!A1","v":"Contractor Name: "},{"$f":"+Apr!B1","v":0},null,"Month:",{"$f":"+Apr!E1+31","v":"2024-05-04"},"Contract #:",{"$f":"Budget!C9","v":0},"GRANT AWARD AMOUNT: ",null,{"$f":"+Budget!I17","v":0}]
[{"$f":"+Apr!A2","v":"Project Name: "},{"$f":"VLOOKUP($B$1,Sheet1!$B$5:$AK$7,4,FALSE)","v":{"$error":"#N/A"}},null,null,null,"Contact: ",{"$f":"+Apr!G2","v":{"$error":"#N/A"}},{"$f":"+Apr!H2","v":"Phone:  "},{"$f":"+Apr!I2","v":{"$error":"#N/A"}}]
[null,{"$f":"VLOOKUP($B$1,Sheet1!$B$5:$AM$7,37,FALSE)","v":{"$error":"#N/A"}},null,null,null,"Address:",{"$f":"+Apr!G3","v":0}]
[]
[null,null,null,null,null,"Current Month Expenditures by Funding Source"]
[" Item  Description",null,"Authorized Budget ","YTD Actual Expenses ","Current Month Expenses ","Grant Funds","Cash Match","In-Kind Match","Program Income","Cash Non-Match"]
["APPROVED BUDGET",null,{"$f":"+Apr!C7","v":0},{"$f":"+D47","v":0},{"$f":"+E46","v":0},{"$f":"+Budget!F36","v":0},{"$f":"+Budget!F29","v":0},{"$f":"+Budget!F30","v":0},{"$f":"+Budget!F35","v":0},{"$f":"+Budget!F300","v":0}]
[]
{"$rows_left_out":52}
{"sheet":"Jun","index":13,"n_rows":59,"n_cols":10,"rows_kept":59,"cut":false,"hidden":false,"merged":[[54,1,54,2],[51,9,52,9],[53,9,54,9],[0,7,0,8],[0,1,0,2],[16,0,16,1],[20,0,20,1],[29,0,29,1],[25,0,25,1],[4,5,4,9],[2,6,2,8],[56,3,56,4],[50,0,50,9],[57,3,57,4],[58,3,58,4],[43,0,43,1],[48,5,48,7],[46,0,46,1],[56,0,56,1],[47,0,47,1],[49,0,49,9],[48,0,48,1],[51,5,52,7],[53,5,54,7],[51,1,51,2],[53,1,53,2],[52,1,52,2]]}
[{"$f":"+May!A1","v":"Contractor Name: "},{"$f":"+May!B1","v":0},null,"Month:",{"$f":"+May!E1+30","v":"2024-06-03"},"Contract #:",{"$f":"Budget!C9","v":0},"GRANT AWARD AMOUNT: ",null,{"$f":"+Budget!I17","v":0}]
[{"$f":"+May!A2","v":"Project Name: "},{"$f":"VLOOKUP($B$1,Sheet1!$B$5:$AK$7,4,FALSE)","v":{"$error":"#N/A"}},null,null,null,"Contact: ",{"$f":"+May!G2","v":{"$error":"#N/A"}},{"$f":"+May!H2","v":"Phone:  "},{"$f":"+May!I2","v":{"$error":"#N/A"}}]
[null,{"$f":"VLOOKUP($B$1,Sheet1!$B$5:$AM$7,37,FALSE)","v":{"$error":"#N/A"}},null,null,null,"Address:",{"$f":"+May!G3","v":0}]
[]
[null,null,null,null,null,"Current Month Expenditures by Funding Source"]
[" Item  Description",null,"Authorized Budget ","YTD Actual Expenses ","Current Month Expenses ","Grant Funds","Cash Match","In-Kind Match","Program Income","Cash Non-Match"]
["APPROVED BUDGET",null,{"$f":"+May!C7","v":0},{"$f":"+D47","v":0},{"$f":"+E46","v":0},{"$f":"+Budget!F36","v":0},{"$f":"+Budget!F29","v":0},{"$f":"+Budget!F30","v":0},{"$f":"+Budget!F35","v":0},{"$f":"+Budget!F300","v":0}]
[]
{"$rows_left_out":52}
{"sheet":"CloseOut","index":14,"n_rows":65,"n_cols":10,"rows_kept":65,"cut":false,"hidden":false,"merged":[[0,7,0,8],[4,6,4,9],[0,1,0,2],[13,0,13,1],[62,3,62,4],[23,0,23,1],[5,6,5,7],[6,6,6,7],[7,6,7,7],[8,6,8,7],[49,0,49,1],[50,0,50,1],[55,0,55,9],[62,0,62,1],[52,0,52,1],[53,0,53,1],[56,0,56,9],[54,6,54,8],[64,3,64,4],[27,0,27,1],[31,0,31,1],[35,0,35,1],[63,3,63,4],[54,0,54,1],[57,1,57,2],[57,5,58,7],[57,9,58,9],[58,1,58,2],[59,1,59,2],[59,5,60,7],[59,9,60,9],[60,1,60,2]]}
[{"$f":"+May!A1","v":"Contractor Name: "},{"$f":"+May!B1","v":0},null,"Month:","CLOSEOUT FY2122","Contract #:",{"$f":"Budget!C9","v":0},"GRANT AWARD AMOUNT: ",null,{"$f":"+Budget!I17","v":0}]
[{"$f":"+May!A2","v":"Project Name: "},{"$f":"VLOOKUP($B$1,Sheet1!$B$5:$AK$7,4,FALSE)","v":{"$error":"#N/A"}},null,null,null,"Contact: ",{"$f":"+May!G2","v":{"$error":"#N/A"}},{"$f":"+May!H2","v":"Phone:  "},{"$f":"+May!I2","v":{"$error":"#N/A"}}]
[null,{"$f":"VLOOKUP($B$1,Sheet1!$B$5:$AM$7,37,FALSE)","v":{"$error":"#N/A"}},null,null,null,"Address:",{"$f":"+May!G3","v":0},null,null,"Inv: LGL CO22"]
[]
[null,null,null,null,null,null,"TOTAL PROJECT COST"]
[null,null,null,null,null,null,"COSTS TO BE MATCHED",null,null,{"$f":"D53+E52","v":0}]
[null,null,null,null,null,null,"MATCHING CASH",null,{"$f":"+G53","v":0}]
[null,null,null,null,null,null,"MATCHING IN-KIND",null,{"$f":"H53","v":0}]
{"$rows_left_out":57}