{"text_format":"1","workbook":"xlsx","n_sheets":16,"sheets":["Sheet1","Budget","Jul","Aug","Sep","Oct","Nov","Dec","Jan","Feb","Mar","Apr","May","Jun","CloseOut","Sheet2"],"not_rendered":{"charts":0,"images":0,"macros":0,"external_links":0,"defined_names":30,"comments":0,"pivot_tables":0},"unopened":[],"bounds":{"document_bytes":16777216,"sheet_cells":100000,"rows_first":2000,"rows_last":500,"rows_between":2000,"halvings":0,"cell_chars":16384,"cell_head_chars":4096},"cells_cut":0,"cells_raw":0,"read":"whole","date_system":"1900"}

{"sheet":"Sheet1","index":0,"n_rows":25,"n_cols":22,"rows_kept":25,"cut":false,"hidden":true,"merged":[]}
[null,"Beginning Date","2011-07-01",null,null,null,null,null,null,null,null,null,null,null,null,null,null,{"$f":"+R2+N2","v":161877.0}]
[null,null,null,null,null,null,null,null,null,null,null,null,null,{"$f":"SUM(L5:N5)","v":61515.0},null,null,null,{"$f":"SUM(P5:R5)","v":100362.0}]
[null,null,null,null,null,null,null,null,null,null,null,11.0,null,null,null,null,null,null,null,19.0,null,21.0]
[null,"Select A Name","Grant #","PO#","Program ","C1",null,"C2",null,"Federal Funds",null,"Cash Match C1","In-Kind Match C1","Program Income C1","Cash                  Non-Match","Cash Match C2","In-Kind Match C2","Program Income C2",null,"Contact","Phone","Address"]
[1.0,"Camarillo Health Care District","3C-002-071213-R1","PC5700BTBD","VCAAA Senior Nutrition Program",{"$f":"0.38*J5","v":26423.68},{"$f":"+F5/J5","v":0.38},{"$f":"0.62*J5","v":43112.32},{"$f":"+H5/J5","v":0.62},69536.0,null,{"$f":"46681-M5+8","v":29689.0},17000.0,14826.0,0.0,{"$f":"76163-Q5+8","v":48434.0},27737.0,24191.0,null,"Yvonne Ontiveros","(805) 388-1952 x143 ","3639 E. Las Posas Rd., Camarillo, CA 93010."]
[2.0,"City of Fillmore","3C-004-071213-R1","PC5700BTBD","VCAAA Senior Nutrition Program",10601.0,{"$f":"+F6/J6","v":0.53005},9399.0,{"$f":"+H6/J6","v":0.46995},20000.0,null,{"$f":"18227-M6","v":8242.0},9985.0,2831.0,null,{"$f":"16163-Q6","v":7308.0},8855.0,3682.0,null,"Annette Cardona","(805) 524-1500 x216","250 Central Ave, Fillmore, CA"]
{"$rows_left_out":20}
{"sheet":"Budget","index":1,"n_rows":126,"n_cols":32,"rows_kept":126,"cut":false,"hidden":false,"merged":[[35,1,35,2],[35,11,35,12],[36,1,36,2],[36,11,36,12],[29,1,29,2],[29,11,29,12],[32,1,32,2],[51,1,51,8],[51,11,51,18],[46,1,46,2],[46,11,46,12],[47,1,47,2],[47,11,47,12],[49,1,49,2],[49,11,49,12],[25,22,25,24],[32,11,32,12],[26,22,26,24],[27,22,27,24],[28,1,28,2],[28,11,28,12],[28,22,28,24],[29,22,29,24],[20,23,20,24],[20,29,20,30],[23,22,23,24],[24,1,24,2],[24,11,24,12],[24,22,24,24],[12,26,12,29],[13,26,13,29],[19,1,19,2],[19,11,19,12],[19,23,19,24],[19,29,19,30],[16,23,16,24],[16,25,16,26],[16,27,16,28],[16,29,16,30],[7,13,8,13],[5,12,6,12],[5,15,5,16],[5,17,5,18],[7,15,7,16],[7,17,7,18],[6,15,6,16],[6,17,6,18],[9,1,9,2],[9,11,9,12],[7,5,7,6],[7,7,7,8],[7,11,8,12],[7,1,8,2],[7,3,8,3],[5,1,6,1],[5,2,6,2],[5,5,5,6],[5,7,5,8],[5,11,6,11],[6,5,6,6],[6,7,6,8],[1,4,1,5],[1,14,1,15],[4,2,4,9],[4,12,4,19],[4,22,4,29],[0,24,0,26],[47,21,48,23],[47,24,48,31],[30,22,30,24],[39,22,39,24],[31,22,31,24],[29,29,33,30],[7,24,7,25],[5,21,6,21],[5,22,6,23],[5,24,5,25],[6,24,6,25],[13,21,13,22],[11,21,12,22],[13,23,13,25],[12,23,12,25]]}
[null,"VCAAA Senior Nutrition Program",null,null,null,null,null,null,null,null,null,"VCAAA Senior Nutrition Program",null,null,null,null,null,null,null,null,null,"VCAAA Senior Nutrition Program",null,null,"SNP RFP \"ATTACHMENT B\"",null,null,null,"Enter budget data in light blue cells!"]
[null,"PROJECT BUDGET - July 1, 2020  through June 30, 2021",null,null,"Congregate Meals - C1",null,null,null,null,null,null,{"$f":"+B2","v":"PROJECT BUDGET - July 1, 2020  through June 30, 2021"},null,null,"Home Delivered Meals - C2",null,null,null,null,null,null,{"$f":"+L2","v":"PROJECT BUDGET - July 1, 2020  through June 30, 2021"},null,null,null,null,null,"2020-07-01","2021-06-30"]
[]
[]
[null,"AGENCY NAME:      ",{"$f":"+W5","v":"Agency Name"},{"$f":"LEFT(#REF!,FIND(\" \",#REF!))&MID(#REF!,FIND(\" \",#REF!,1)+1,LEN(#REF!))","v":{"$error":"#REF!"}},{"$f":"LEFT(#REF!,FIND(\" \",#REF!))&MID(#REF!,FIND(\" \",#REF!,1)+1,LEN(#REF!))","v":{"$error":"#REF!"}},{"$f":"LEFT(#REF!,FIND(\" \",#REF!))&MID(#REF!,FIND(\" \",#REF!,1)+1,LEN(#REF!))","v":{"$error":"#REF!"}},{"$f":"LEFT(#REF!,FIND(\" \",#REF!))&MID(#REF!,FIND(\" \",#REF!,1)+1,LEN(#REF!))","v":{"$error":"#REF!"}},{"$f":"LEFT(#REF!,FIND(\" \",#REF!))&MID(#REF!,FIND(\" \",#REF!,1)+1,LEN(#REF!))","v":{"$error":"#REF!"}},{"$f":"LEFT(#REF!,FIND(\" \",#REF!))&MID(#REF!,FIND(\" \",#REF!,1)+1,LEN(#REF!))","v":{"$error":"#REF!"}},{"$f":"LEFT(#REF!,FIND(\" \",#REF!))&MID(#REF!,FIND(\" \",#REF!,1)+1,LEN(#REF!))","v":{"$error":"#REF!"}},null,"AGENCY NAME:       ",{"$f":"LEFT(C5,FIND(\" \",C5))&MID(C5,FIND(\" \",C5,1)+1,LEN(C5))","v":"Agency Name"},{"$f":"LEFT(#REF!,FIND(\" \",#REF!))&MID(#REF!,FIND(\" \",#REF!,1)+1,LEN(#REF!))","v":{"$error":"#REF!"}},{"$f":"LEFT(#REF!,FIND(\" \",#REF!))&MID(#REF!,FIND(\" \",#REF!,1)+1,LEN(#REF!))","v":{"$error":"#REF!"}},{"$f":"LEFT(#REF!,FIND(\" \",#REF!))&MID(#REF!,FIND(\" \",#REF!,1)+1,LEN(#REF!))","v":{"$error":"#REF!"}},{"$f":"LEFT(#REF!,FIND(\" \",#REF!))&MID(#REF!,FIND(\" \",#REF!,1)+1,LEN(#REF!))","v":{"$error":"#REF!"}},{"$f":"LEFT(#REF!,FIND(\" \",#REF!))&MID(#REF!,FIND(\" \",#REF!,1)+1,LEN(#REF!))","v":{"$error":"#REF!"}},{"$f":"LEFT(#REF!,FIND(\" \",#REF!))&MID(#REF!,FIND(\" \",#REF!,1)+1,LEN(#REF!))","v":{"$error":"#REF!"}},{"$f":"LEFT(#REF!,FIND(\" \",#REF!))&MID(#REF!,FIND(\" \",#REF!,1)+1,LEN(#REF!))","v":{"$error":"#REF!"}},null,"AGENCY NAME:       ","Agency Name"]
[null,"ESTIMATED NUMBER OF MEALS (ANNUAL):",1000.0,"Cost/Meal","Grant/Meal","CONTACT NAME",null,{"$f":"+R6","v":"First Last"},null,null,null,"ESTIMATED NUMBER OF MEALS (ANNUAL):",1000.0,"Cost/Meal","Grant/Meal","CONTACT NAME",null,{"$f":"+AA6","v":"First Last"},null,null,null,"ESTIMATED NUMBER OF MEALS (ANNUAL):",{"$f":"+C6+M6","v":2000.0},null,"CONTACT NAME",null,"First Last"]
{"$rows_left_out":121}
{"sheet":"Jul","index":2,"n_rows":69,"n_cols":29,"rows_kept":69,"cut":false,"hidden":true,"merged":[[66,6,66,7],[64,15,64,16],[65,6,65,7],[56,8,56,11],[64,11,64,13],[56,0,56,1],[34,0,34,1],[64,6,64,7],[56,13,56,17],[0,1,0,3],[55,13,55,17],[55,8,55,11],[2,2,2,3],[8,8,8,17],[26,0,26,1],[57,0,57,17],[52,0,52,1],[30,0,30,1],[49,0,49,1],[64,0,64,1],[54,13,54,17],[54,8,54,11],[53,0,53,1],[7,0,7,1],[2,9,2,13],[37,0,37,1],[55,0,55,1],[8,0,8,1],[21,0,21,1],[54,0,54,1],[9,2,9,3]]}
["Contractor Name: ",{"$f":"+Budget!C5","v":"Agency Name"},null,null,"Month:",{"$f":"+Budget!AB2","v":"2020-07-01"},null,null,"PO#",{"$f":"+Budget!W8","v":0.0},null,null,"GRANT AWARD AMOUNT: ",null,"C1: ",{"$f":"+Budget!Z40","v":0.0},"C2:",{"$f":"+Budget!AA40","v":0.0}]
["Project Name: ",{"$f":"VLOOKUP($B$1,Sheet1!$B$5:$V$17,4,FALSE)","v":{"$error":"#N/A"}},null,null,"Grant#: ",{"$f":"+Budget!V10","v":0.0},null,null,"Contact: ",{"$f":"+Budget!AA6","v":"First Last"},null,"Phone:  ",{"$f":"+Budget!AA7","v":"(XXX) XXX-XXXX"},null,null,"Total C1/C2:",null,{"$f":"+P1+R1","v":0.0}]
[null,null,null,null,null,null,null,null,"Address:",{"$f":"+Budget!AA8","v":"Street Address, City, CA 93XXX"},{"$f":"VLOOKUP($B$1,Sheet1!$B$5:$V$17,19,FALSE)","v":{"$error":"#N/A"}},{"$f":"VLOOKUP($B$1,Sheet1!$B$5:$V$17,19,FALSE)","v":{"$error":"#N/A"}},{"$f":"VLOOKUP($B$1,Sheet1!$B$5:$V$17,19,FALSE)","v":{"$error":"#N/A"}},{"$f":"VLOOKUP($B$1,Sheet1!$B$5:$V$17,19,FALSE)","v":{"$error":"#N/A"}}]
["Number of Meals Served",null,"C1","C2"]
[null,"Month",0.0,0.0,null,null,null,null,"Current Month Expenditures by Funding Source"]
[null,"YTD",{"$f":"+C5","v":0.0},{"$f":"+D5","v":0.0},null,null,null,null,null,null,null,null,null,null,null,null,null,null,null,"YTD"]
{"$rows_left_out":64}
{"sheet":"Aug","index":3,"n_rows":69,"n_cols":29,"rows_kept":69,"cut":false,"hidden":true,"merged":[[64,6,64,7],[34,0,34,1],[66,6,66,7],[65,6,65,7],[64,0,64,1],[57,0,57,17],[64,11,64,13],[64,15,64,17],[56,8,56,11],[56,13,56,17],[55,0,55,1],[56,0,56,1],[54,0,54,1],[53,0,53,1],[52,0,52,1],[8,8,8,17],[55,8,55,11],[49,0,49,1],[37,0,37,1],[55,13,55,17],[54,8,54,11],[54,13,54,17],[9,2,9,3],[8,0,8,1],[26,0,26,1],[21,0,21,1],[30,0,30,1]]}
["Contractor Name: ",{"$f":"+Jul!B1","v":"Agency Name"},null,null,"Month:",{"$f":"+Jul!F1+31","v":"2020-08-01"},null,null,"PO#",{"$f":"+Jul!J1","v":0.0},null,null,"GRANT AWARD AMOUNT: ",null,"C1: ",{"$f":"+Jul!P1","v":0.0},"C2:",{"$f":"+Jul!R1","v":0.0}]
["Project Name: ",{"$f":"+Budget!B1","v":"VCAAA Senior Nutrition Program"},null,null,"Grant#: ",{"$f":"+Jul!F2","v":0.0},null,null,"Contact: ",{"$f":"+Jul!J2","v":"First Last"},null,"Phone:  ",{"$f":"+Jul!M2","v":"(XXX) XXX-XXXX"},null,null,{"$f":"+Jul!P2","v":"Total C1/C2:"},null,{"$f":"+P1+R1","v":0.0}]
[null,null,null,null,null,null,null,null,"Address:",{"$f":"+Jul!J3","v":"Street Address, City, CA 93XXX"}]
["Number of Meals Served",null,"C1","C2"]
[null,"Month",null,null,null,null,null,null,"Current Month Expenditures by Funding Source"]
[null,"YTD",{"$f":"+C5+Jul!C6","v":0.0},{"$f":"+D5+Jul!D6","v":0.0}]
{"$rows_left_out":64}
{"sheet":"Sep","index":4,"n_rows":69,"n_cols":29,"rows_kept":69,"cut":false,"hidden":true,"merged":[[0,1,0,3],[66,6,66,7],[64,11,64,13],[54,8,54,11],[54,13,54,17],[55,8,55,11],[55,13,55,17],[52,0,52,1],[53,0,53,1],[55,0,55,1],[1,5,1,6],[2,9,2,13],[64,15,64,17],[65,6,65,7],[64,6,64,7],[56,8,56,11],[56,13,56,17],[57,0,57,17],[56,0,56,1],[64,0,64,1],[8,8,8,17],[54,0,54,1],[26,0,26,1],[7,0,7,1],[9,2,9,3],[34,0,34,1],[30,0,30,1],[49,0,49,1],[37,0,37,1],[21,0,21,1]]}
[{"$f":"+Aug!A1","v":"Contractor Name: "},{"$f":"+Aug!B1","v":"Agency Name"},null,null,"Month:",{"$f":"+Aug!F1+31","v":"2020-09-01"},null,null,"PO#",{"$f":"+Aug!J1","v":0.0},null,null,"GRANT AWARD AMOUNT: ",null,"C1: ",{"$f":"+Jul!P1","v":0.0},"C2:",{"$f":"+Jul!R1","v":0.0}]
[{"$f":"+Aug!A2","v":"Project Name: "},{"$f":"+Budget!B1","v":"VCAAA Senior Nutrition Program"},null,null,"Grant#: ",{"$f":"+Aug!F2","v":0.0},null,null,"Contact: ",{"$f":"+Aug!J2","v":"First Last"},null,{"$f":"+Aug!L2","v":"Phone:  "},{"$f":"+Aug!M2","v":"(XXX) XXX-XXXX"},null,null,"Total C:",null,{"$f":"+P1+R1","v":0.0}]
[null,null,null,null,null,null,null,null,"Address:",{"$f":"+Aug!J3","v":"Street Address, City, CA 93XXX"}]
["Number of Meals Served",null,"C1","C2"]
[null,"Month",null,null,null,null,null,null,"Current Month Expenditures by Funding Source"]
[null,"YTD",{"$f":"+C5+Aug!C6","v":0.0},{"$f":"+D5+Aug!D6","v":0.0}]
{"$rows_left_out":64}
{"sheet":"Oct","index":5,"n_rows":69,"n_cols":29,"rows_kept":69,"cut":false,"hidden":true,"merged":[[1,5,1,6],[2,9,2,13],[0,1,0,3],[66,6,66,7],[55,0,55,1],[56,0,56,1],[54,0,54,1],[57,0,57,17],[64,11,64,13],[64,15,64,17],[64,6,64,7],[65,6,65,7],[64,0,64,1],[53,0,53,1],[21,0,21,1],[30,0,30,1],[49,0,49,1],[37,0,37,1],[7,0,7,1],[9,2,9,3],[52,0,52,1],[26,0,26,1],[34,0,34,1],[8,8,8,17],[56,13,56,17],[54,8,54,11],[54,13,54,17],[55,8,55,11],[55,13,55,17],[56,8,56,11]]}
[{"$f":"+Sep!A1","v":"Contractor Name: "},{"$f":"+Sep!B1","v":"Agency Name"},null,null,"Month:",{"$f":"+Sep!F1+31","v":"2020-10-02"},null,null,"PO#",{"$f":"+Sep!J1","v":0.0},null,null,"GRANT AWARD AMOUNT: ",null,"C1: ",{"$f":"+Budget!Z40","v":0.0},"C2:",{"$f":"+Budget!AA40","v":0.0}]
[{"$f":"+Sep!A2","v":"Project Name: "},{"$f":"+Budget!B1","v":"VCAAA Senior Nutrition Program"},null,null,"Grant#: ",{"$f":"+Budget!V10","v":0.0},null,null,"Contact: ",{"$f":"+Sep!J2","v":"First Last"},null,{"$f":"+Sep!L2","v":"Phone:  "},{"$f":"+Sep!M2","v":"(XXX) XXX-XXXX"},null,null,"Total C:",null,{"$f":"+P1+R1","v":0.0}]
[null,null,null,null,null,null,null,null,"Address:",{"$f":"+Sep!J3","v":"Street Address, City, CA 93XXX"}]
["Number of Meals Served",null,"C1","C2"]
[null,"Month",null,null,null,null,null,null,"Current Month Expenditures by Funding Source"]
[null,"YTD",{"$f":"+C5+Sep!C6","v":0.0},{"$f":"+D5+Sep!D6","v":0.0}]
{"$rows_left_out":64}
{"sheet":"Nov","index":6,"n_rows":69,"n_cols":29,"rows_kept":69,"cut":false,"hidden":true,"merged":[[0,1,0,3],[66,6,66,7],[64,11,64,13],[54,8,54,11],[54,13,54,17],[55,8,55,11],[55,13,55,17],[49,0,49,1],[37,0,37,1],[21,0,21,1],[52,0,52,1],[53,0,53,1],[1,5,1,6],[56,0,56,1],[64,0,64,1],[54,0,54,1],[2,9,2,13],[64,15,64,17],[65,6,65,7],[64,6,64,7],[56,8,56,11],[56,13,56,17],[57,0,57,17],[8,8,8,17],[26,0,26,1],[7,0,7,1],[9,2,9,3],[34,0,34,1],[30,0,30,1]]}
[{"$f":"+Oct!A1","v":"Contractor Name: "},{"$f":"+Oct!B1","v":"Agency Name"},null,null,"Month:",{"$f":"+Oct!F1+31","v":"2020-11-02"},null,null,"PO#",{"$f":"+Oct!J1","v":0.0},null,null,"GRANT AWARD AMOUNT: ",null,"C1: ",{"$f":"+Budget!Z40","v":0.0},"C2:",{"$f":"+Budget!AA40","v":0.0}]
[{"$f":"+Oct!A2","v":"Project Name: "},{"$f":"+Budget!B1","v":"VCAAA Senior Nutrition Program"},null,null,"Grant#: ",{"$f":"+Oct!F2","v":0.0},null,null,"Contact: ",{"$f":"+Oct!J2","v":"First Last"},null,{"$f":"+Oct!L2","v":"Phone:  "},{"$f":"+Oct!M2","v":"(XXX) XXX-XXXX"},null,null,"Total C:",null,{"$f":"+P1+R1","v":0.0}]
[null,null,null,null,null,null,null,null,"Address:",{"$f":"+Oct!J3","v":"Street Address, City, CA 93XXX"}]
["Number of Meals Served",null,"C1","C2"]
[null,"Month",null,null,null,null,null,null,"Current Month Expenditures by Funding Source"]
[null,"YTD",{"$f":"+C5+Oct!C6","v":0.0},{"$f":"+D5+Oct!D6","v":0.0}]
{"$rows_left_out":64}
{"sheet":"Dec","index":7,"n_rows":69,"n_cols":29,"rows_kept":69,"cut":false,"hidden":true,"merged":[[0,1,0,3],[66,6,66,7],[64,11,64,13],[64,15,64,17],[65,6,65,7],[64,6,64,7],[56,8,56,11],[56,13,56,17],[54,8,54,11],[64,0,64,1],[49,0,49,1],[37,0,37,1],[53,0,53,1],[57,0,57,17],[8,8,8,17],[56,0,56,1],[1,5,1,7],[9,2,9,3],[26,0,26,1],[34,0,34,1],[30,0,30,1],[2,9,2,13],[54,13,54,17],[55,8,55,11],[55,13,55,17],[52,0,52,1],[21,0,21,1],[54,0,54,1],[7,0,7,1]]}
[{"$f":"+Nov!A1","v":"Contractor Name: "},{"$f":"+Nov!B1","v":"Agency Name"},null,null,"Month:",{"$f":"+Nov!F1+30","v":"2020-12-02"},null,null,"PO#",{"$f":"+Nov!J1","v":0.0},null,null,"GRANT AWARD AMOUNT: ",null,"C1: ",{"$f":"+Budget!Z40","v":0.0},"C2:",{"$f":"+Budget!AA40","v":0.0}]
[{"$f":"+Nov!A2","v":"Project Name: "},{"$f":"+Budget!B1","v":"VCAAA Senior Nutrition Program"},null,null,"Grant#: ",{"$f":"+Nov!F2","v":0.0},null,null,"Contact: ",{"$f":"+Nov!J2","v":"First Last"},null,{"$f":"+Nov!L2","v":"Phone:  "},{"$f":"+Nov!M2","v":"(XXX) XXX-XXXX"},null,null,"Total C:",null,{"$f":"+P1+R1","v":0.0}]
[null,null,null,null,null,null,null,null,"Address:",{"$f":"+Aug!J3","v":"Street Address, City, CA 93XXX"}]
["Number of Meals Served",null,"C1","C2"]
[null,"Month",null,null,null,null,null,null,"Current Month Expenditures by Funding Source"]
[null,"YTD",{"$f":"+C5+Nov!C6","v":0.0},{"$f":"+D5+Nov!D6","v":0.0}]
{"$rows_left_out":64}
{"sheet":"Jan","index":8,"n_rows":69,"n_cols":29,"rows_kept":69,"cut":false,"hidden":true,"merged":[[2,9,2,13],[0,1,0,3],[66,6,66,7],[64,11,64,13],[64,15,64,17],[65,6,65,7],[64,6,64,7],[56,8,56,11],[56,13,56,17],[54,8,54,11],[64,0,64,1],[49,0,49,1],[37,0,37,1],[53,0,53,1],[57,0,57,17],[8,8,8,17],[56,0,56,1],[54,0,54,1],[7,0,7,1],[9,2,9,3],[26,0,26,1],[34,0,34,1],[30,0,30,1],[54,13,54,17],[55,8,55,11],[55,13,55,17],[52,0,52,1],[21,0,21,1]]}
[{"$f":"+Dec!A1","v":"Contractor Name: "},{"$f":"+Dec!B1","v":"Agency Name"},null,null,"Month:",{"$f":"+Dec!F1+31","v":"2021-01-02"},null,null,"PO#",{"$f":"+Dec!J1","v":0.0},null,null,"GRANT AWARD AMOUNT: ",null,"C1: ",{"$f":"+Budget!Z40","v":0.0},"C2:",{"$f":"+Budget!AA40","v":0.0}]
[{"$f":"+Dec!A2","v":"Project Name: "},{"$f":"+Budget!B1","v":"VCAAA Senior Nutrition Program"},null,null,"Grant#: ",{"$f":"+Dec!F2","v":0.0},null,null,"Contact: ",{"$f":"+Dec!J2","v":"First Last"},null,{"$f":"+Dec!L2","v":"Phone:  "},{"$f":"+Dec!M2","v":"(XXX) XXX-XXXX"},null,null,"Total C:",null,{"$f":"+P1+R1","v":0.0}]
[null,null,null,null,null,null,null,null,"Address:",{"$f":"+Dec!J3","v":"Street Address, City, CA 93XXX"}]
["Number of Meals Served",null,"C1","C2"]
[null,"Month",null,null,null,null,null,null,"Current Month Expenditures by Funding Source"]
[null,"YTD",{"$f":"+C5+Dec!C6","v":0.0},{"$f":"+D5+Dec!D6","v":0.0}]
{"$rows_left_out":64}
{"sheet":"Feb","index":9,"n_rows":69,"n_cols":29,"rows_kept":69,"cut":false,"hidden":true,"merged":[[57,0,57,17],[0,1,0,3],[66,6,66,7],[64,11,64,13],[64,15,64,17],[65,6,65,7],[64,6,64,7],[56,13,56,17],[54,8,54,11],[54,13,54,17],[55,8,55,11],[8,8,8,17],[7,0,7,1],[9,2,9,3],[56,0,56,1],[54,0,54,1],[55,13,55,17],[52,0,52,1],[53,0,53,1],[21,0,21,1],[56,8,56,11],[26,0,26,1],[34,0,34,1],[30,0,30,1],[49,0,49,1],[37,0,37,1]]}
[{"$f":"+Jan!A1","v":"Contractor Name: "},{"$f":"+Jan!B1","v":"Agency Name"},null,null,"Month:",{"$f":"+Jan!F1+31","v":"2021-02-02"},null,null,"PO#",{"$f":"+Jan!J1","v":0.0},null,null,"GRANT AWARD AMOUNT: ",null,"C1: ",{"$f":"+Budget!Z40","v":0.0},"C2:",{"$f":"+Budget!AA40","v":0.0}]
[{"$f":"+Jan!A2","v":"Project Name: "},{"$f":"+Budget!B1","v":"VCAAA Senior Nutrition Program"},null,null,"Grant#: ",{"$f":"+Jan!F2","v":0.0},null,null,"Contact: ",{"$f":"+Jan!J2","v":"First Last"},null,{"$f":"+Jan!L2","v":"Phone:  "},{"$f":"+Jan!M2","v":"(XXX) XXX-XXXX"},null,null,"Total C:",null,{"$f":"+P1+R1","v":0.0}]
[null,null,null,null,null,null,null,null,"Address:",{"$f":"+Jan!J3","v":"Street Address, City, CA 93XXX"}]
["Number of Meals Served",null,"C1","C2"]
[null,"Month",null,null,null,null,null,null,"Current Month Expenditures by Funding Source"]
[null,"YTD",{"$f":"+C5+Jan!C6","v":0.0},{"$f":"+D5+Jan!D6","v":0.0}]
{"$rows_left_out":64}
{"sheet":"Mar","index":10,"n_rows":69,"n_cols":29,"rows_kept":69,"cut":false,"hidden":true,"merged":[[2,9,2,13],[0,1,0,3],[66,6,66,7],[64,11,64,13],[64,15,64,17],[65,6,65,7],[64,6,64,7],[56,8,56,11],[56,13,56,17],[54,8,54,11],[64,0,64,1],[49,0,49,1],[37,0,37,1],[53,0,53,1],[57,0,57,17],[8,8,8,17],[56,0,56,1],[54,0,54,1],[7,0,7,1],[9,2,9,3],[26,0,26,1],[34,0,34,1],[30,0,30,1],[54,13,54,17],[55,8,55,11],[55,13,55,17],[52,0,52,1],[21,0,21,1]]}
[{"$f":"+Feb!A1","v":"Contractor Name: "},{"$f":"+Feb!B1","v":"Agency Name"},null,null,"Month:",{"$f":"+Feb!F1+31","v":"2021-03-05"},null,null,"PO#",{"$f":"+Feb!J1","v":0.0},null,null,"GRANT AWARD AMOUNT: ",null,"C1: ",{"$f":"+Budget!Z40","v":0.0},"C2:",{"$f":"+Budget!AA40","v":0.0}]
[{"$f":"+Feb!A2","v":"Project Name: "},{"$f":"+Budget!B1","v":"VCAAA Senior Nutrition Program"},null,null,"Grant#: ",{"$f":"+Feb!F2","v":0.0},null,null,"Contact: ",{"$f":"+Feb!J2","v":"First Last"},null,{"$f":"+Feb!L2","v":"Phone:  "},{"$f":"+Feb!M2","v":"(XXX) XXX-XXXX"},null,null,"Total C:",null,{"$f":"+P1+R1","v":0.0}]
[null,null,null,null,null,null,null,null,"Address:",{"$f":"+Feb!J3","v":"Street Address, City, CA 93XXX"}]
["Number of Meals Served",null,"C1","C2"]
[null,"Month",null,null,null,null,null,null,"Current Month Expenditures by Funding Source"]
[null,"YTD",{"$f":"+C5+Feb!C6","v":0.0},{"$f":"+D5+Feb!D6","v":0.0}]
{"$rows_left_out":64}
{"sheet":"Apr","index":11,"n_rows":69,"n_cols":29,"rows_kept":69,"cut":false,"hidden":true,"merged":[[2,9,2,13],[0,1,0,3],[66,6,66,7],[64,11,64,13],[64,15,64,17],[65,6,65,7],[64,6,64,7],[56,8,56,11],[56,13,56,17],[54,8,54,11],[64,0,64,1],[49,0,49,1],[37,0,37,1],[53,0,53,1],[57,0,57,17],[8,8,8,17],[56,0,56,1],[54,0,54,1],[7,0,7,1],[9,2,9,3],[26,0,26,1],[34,0,34,1],[30,0,30,1],[54,13,54,17],[55,8,55,11],[55,13,55,17],[52,0,52,1],[21,0,21,1]]}
[{"$f":"+Mar!A1","v":"Contractor Name: "},{"$f":"+Mar!B1","v":"Agency Name"},null,null,"Month:",{"$f":"+Mar!F1+30","v":"2021-04-04"},null,null,"PO#",{"$f":"+Mar!J1","v":0.0},null,null,"GRANT AWARD AMOUNT: ",null,"C1: ",{"$f":"+Budget!Z40","v":0.0},"C2:",{"$f":"+Budget!AA40","v":0.0}]
[{"$f":"+Mar!A2","v":"Project Name: "},{"$f":"+Budget!B1","v":"VCAAA Senior Nutrition Program"},null,null,"Grant#: ",{"$f":"+Mar!F2","v":0.0},null,null,"Contact: ",{"$f":"+Mar!J2","v":"First Last"},null,{"$f":"+Mar!L2","v":"Phone:  "},{"$f":"+Mar!M2","v":"(XXX) XXX-XXXX"},null,null,"Total C:",null,{"$f":"+P1+R1","v":0.0}]
[null,null,null,null,null,null,null,null,"Address:",{"$f":"+Mar!J3","v":"Street Address, City, CA 93XXX"}]
["Number of Meals Served",null,"C1","C2"]
[null,"Month",null,null,null,null,null,null,"Current Month Expenditures by Funding Source"]
[null,"YTD",{"$f":"+C5+Mar!C6","v":0.0},{"$f":"+D5+Mar!D6","v":0.0}]
{"$rows_left_out":64}
{"sheet":"May","index":12,"n_rows":69,"n_cols":29,"rows_kept":69,"cut":false,"hidden":true,"merged":[[2,9,2,13],[0,1,0,3],[66,6,66,7],[64,11,64,13],[64,15,64,17],[65,6,65,7],[64,6,64,7],[56,8,56,11],[56,13,56,17],[54,8,54,11],[64,0,64,1],[49,0,49,1],[37,0,37,1],[53,0,53,1],[57,0,57,17],[8,8,8,17],[56,0,56,1],[54,0,54,1],[7,0,7,1],[9,2,9,3],[26,0,26,1],[34,0,34,1],[30,0,30,1],[54,13,54,17],[55,8,55,11],[55,13,55,17],[52,0,52,1],[21,0,21,1]]}
[{"$f":"+Apr!A1","v":"Contractor Name: "},{"$f":"+Apr!B1","v":"Agency Name"},null,null,"Month:",{"$f":"+Apr!F1+31","v":"2021-05-05"},null,null,"PO#",{"$f":"+Apr!J1","v":0.0},null,null,"GRANT AWARD AMOUNT: ",null,"C1: ",{"$f":"+Budget!Z40","v":0.0},"C2:",{"$f":"+Budget!AA40","v":0.0}]
[{"$f":"+Apr!A2","v":"Project Name: "},{"$f":"+Budget!B1","v":"VCAAA Senior Nutrition Program"},null,null,"Grant#: ",{"$f":"+Apr!F2","v":0.0},null,null,"Contact: ",{"$f":"+Apr!J2","v":"First Last"},null,{"$f":"+Apr!L2","v":"Phone:  "},{"$f":"+Apr!M2","v":"(XXX) XXX-XXXX"},null,null,"Total C:",null,{"$f":"+P1+R1","v":0.0}]
[null,null,null,null,null,null,null,null,"Address:",{"$f":"+Apr!J3","v":"Street Address, City, CA 93XXX"}]
["Number of Meals Served",null,"C1","C2"]
[null,"Month",null,null,null,null,null,null,"Current Month Expenditures by Funding Source"]
[null,"YTD",{"$f":"+C5+Apr!C6","v":0.0},{"$f":"+D5+Apr!D6","v":0.0}]
{"$rows_left_out":64}
{"sheet":"Jun","index":13,"n_rows":69,"n_cols":29,"rows_kept":69,"cut":false,"hidden":true,"merged":[[2,9,2,13],[0,1,0,3],[66,6,66,7],[64,11,64,13],[64,15,64,17],[65,6,65,7],[64,6,64,7],[56,8,56,11],[56,13,56,17],[54,8,54,11],[64,0,64,1],[49,0,49,1],[37,0,37,1],[53,0,53,1],[57,0,57,17],[8,8,8,17],[56,0,56,1],[54,0,54,1],[7,0,7,1],[9,2,9,3],[26,0,26,1],[34,0,34,1],[30,0,30,1],[54,13,54,17],[55,8,55,11],[55,13,55,17],[52,0,52,1],[21,0,21,1]]}
[{"$f":"+May!A1","v":"Contractor Name: "},{"$f":"+May!B1","v":"Agency Name"},null,null,"Month:",{"$f":"+May!F1+30","v":"2021-06-04"},null,null,"PO#",{"$f":"+May!J1","v":0.0},null,null,"GRANT AWARD AMOUNT: ",null,"C1: ",{"$f":"+Budget!Z40","v":0.0},"C2:",{"$f":"+Budget!AA40","v":0.0}]
[{"$f":"+May!A2","v":"Project Name: "},{"$f":"+Budget!B1","v":"VCAAA Senior Nutrition Program"},null,null,"Grant#: ",{"$f":"+May!F2","v":0.0},null,null,"Contact: ",{"$f":"+May!J2","v":"First Last"},null,{"$f":"+May!L2","v":"Phone:  "},{"$f":"+May!M2","v":"(XXX) XXX-XXXX"},null,null,"Total C:",null,{"$f":"+P1+R1","v":0.0}]
[null,null,null,null,null,null,null,null,"Address:",{"$f":"+May!J3","v":"Street Address, City, CA 93XXX"}]
["Number of Meals Served",null,"C1","C2"]
[null,"Month",null,null,null,null,null,null,"Current Month Expenditures by Funding Source"]
[null,"YTD",{"$f":"+C5+May!C6","v":0.0},{"$f":"+D5+May!D6","v":0.0},null,null,null,null,null,null,null,null,null,null,null,null,null,null,null,"YTD"]
{"$rows_left_out":64}
{"sheet":"CloseOut","index":14,"n_rows":68,"n_cols":29,"rows_kept":68,"cut":false,"hidden":true,"merged":[[2,9,2,13],[67,6,67,7],[8,12,8,14],[65,6,65,7],[66,6,66,7],[3,12,3,14],[4,12,4,14],[5,12,5,14],[6,12,6,14],[7,12,7,14],[15,8,15,17],[40,0,40,1],[32,0,32,1],[27,0,27,1],[60,0,60,17],[65,0,65,1],[65,11,65,13],[65,15,65,17],[58,0,58,1],[58,8,58,11],[59,0,59,1],[59,8,59,11],[59,13,59,17],[6,0,6,1],[56,0,56,1],[58,13,58,17],[10,12,10,13],[16,2,16,3],[16,0,16,1],[9,12,9,14],[57,0,57,1],[57,8,57,11],[57,13,57,17],[52,0,52,1],[53,0,53,1],[55,0,55,1],[43,0,43,1],[14,0,14,1],[36,0,36,1]]}
[{"$f":"+May!A1","v":"Contractor Name: "},{"$f":"+May!B1","v":"Agency Name"},null,null,"Month:",{"$f":"+May!F1+30","v":"2021-06-04"},null,null,"PO#",{"$f":"+Jun!J1","v":0.0},null,null,"GRANT AWARD AMOUNT: ",null,"C1: ",{"$f":"+Budget!Z40","v":0.0},"C2:",{"$f":"+Budget!AA40","v":0.0}]
[{"$f":"+May!A2","v":"Project Name: "},{"$f":"+Budget!B1","v":"VCAAA Senior Nutrition Program"},null,null,"Grant#: ",{"$f":"+Jun!F2","v":0.0},null,null,"Contact: ",{"$f":"+Jun!J2","v":"First Last"},null,{"$f":"+May!L2","v":"Phone:  "},{"$f":"+Jun!M2","v":"(XXX) XXX-XXXX"},null,"Total Award:",null,null,{"$f":"+P1+R1","v":0.0}]
[null,null,null,null,null,null,null,null,{"$f":"+Jun!I3","v":"Address:"},{"$f":"+Jun!J3","v":"Street Address, City, CA 93XXX"}]
[null,null,null,null,null,null,null,null,null,null,null,null,"TOTAL PROJECT COST",null,null,null,{"$f":"+E15+F15","v":0.0}]
[null,null,null,null,null,null,null,null,null,null,null,null,"LESS: NON-MATCH",null,null,null,{"$f":"+Q17+R17","v":0.0}]
[null,null,null,null,null,null,null,null,null,null,null,null,"COSTS TO BE MATCHED",null,null,null,{"$f":"+Q4-Q5","v":0.0}]
{"$rows_left_out":63}
{"sheet":"Sheet2","index":15,"n_rows":0,"n_cols":0,"rows_kept":0,"cut":false,"hidden":true,"merged":[]}